{"text_format":"1","workbook":"xlsx","n_sheets":5,"sheets":["ввод","расчет","мощность","цены","округл"],"not_rendered":{"charts":0,"images":0,"macros":1,"external_links":2,"defined_names":2,"comments":0,"pivot_tables":0},"unopened":[],"bounds":{"document_bytes":16777216,"sheet_cells":100000,"rows_first":2000,"rows_last":500,"rows_between":2000,"halvings":0,"cell_chars":16384,"cell_head_chars":4096},"cells_cut":0,"cells_raw":0,"read":"whole","date_system":"1900"}

{"sheet":"ввод","index":0,"n_rows":36,"n_cols":26,"rows_kept":36,"cut":false,"hidden":false,"merged":[[2,0,3,0],[2,1,2,24],[2,25,3,25]]}
["PTVERENE","1. Вставить почасовой профиль электроэнергии в закрашенные ячейки "]
[{"$f":"мощность!B1","v":"июль"},"2. Перейти в лист \"Расчёт\""]
["Дата\\Часы","Фактический почасовой объем  электрической энергии, кВтч",null,null,null,null,null,null,null,null,null,null,null,null,null,null,null,null,null,null,null,null,null,null,null,"Итого"]
[null,1,2,3,4,5,6,7,8,9,10,11,12,13,14,15,16,17,18,19,20,21,22,23,24]
[{"$f":"мощность!AA4","v":"01.07.2025"},null,null,null,null,null,null,null,null,null,null,null,null,null,null,null,null,null,null,null,null,null,null,null,null,{"$f":"SUM(B5:Y5)","v":0}]
[{"$f":"мощность!AA5","v":"02.07.2025"},null,null,null,null,null,null,null,null,null,null,null,null,null,null,null,null,null,null,null,null,null,null,null,null,{"$f":"SUM(B6:Y6)","v":0}]
[{"$f":"мощность!AA6","v":"03.07.2025"},null,null,null,null,null,null,null,null,null,null,null,null,null,null,null,null,null,null,null,null,null,null,null,null,0]
[{"$f":"мощность!AA7","v":"04.07.2025"},null,null,null,null,null,null,null,null,null,null,null,null,null,null,null,null,null,null,null,null,null,null,null,null,0]
[{"$f":"мощность!AA8","v":"05.07.2025"},null,null,null,null,null,null,null,null,null,null,null,null,null,null,null,null,null,null,null,null,null,null,null,null,0]
[{"$f":"мощность!AA9","v":"06.07.2025"},null,null,null,null,null,null,null,null,null,null,null,null,null,null,null,null,null,null,null,null,null,null,null,null,0]
{"$rows_left_out":27}
{"sheet":"расчет","index":1,"n_rows":42,"n_cols":26,"rows_kept":42,"cut":false,"hidden":false,"merged":[[2,0,2,25],[37,0,37,5]]}
["Расчёт объемов и стоимости электроэнергии (мощности) выполнен за",null,null,null,null,null,{"$f":"ввод!A2","v":"июль"}]
[]
["1. Сформирован округленный фактический почасовой объем  электрической энергии, кВтч"]
["Дата\\Часы",1,2,3,4,5,6,7,8,9,10,11,12,13,14,15,16,17,18,19,20,21,22,23,24,"Итого"]
[{"$f":"мощность!AA4","v":"01.07.2025"},{"$f":"мощность!B4","v":0},{"$f":"мощность!C4","v":0},{"$f":"мощность!D4","v":0},{"$f":"мощность!E4","v":0},{"$f":"мощность!F4","v":0},{"$f":"мощность!G4","v":0},{"$f":"мощность!H4","v":0},{"$f":"мощность!I4","v":0},{"$f":"мощность!J4","v":0},{"$f":"мощность!K4","v":0},{"$f":"мощность!L4","v":0},{"$f":"мощность!M4","v":0},{"$f":"мощность!N4","v":0},{"$f":"мощность!O4","v":0},{"$f":"мощность!P4","v":0},{"$f":"мощность!Q4","v":0},{"$f":"мощность!R4","v":0},{"$f":"мощность!S4","v":0},{"$f":"мощность!T4","v":0},{"$f":"мощность!U4","v":0},{"$f":"мощность!V4","v":0},{"$f":"мощность!W4","v":0},{"$f":"мощность!X4","v":0},{"$f":"мощность!Y4","v":0},{"$f":"SUM(B5:Y5)","v":0}]
[{"$f":"мощность!AA5","v":"02.07.2025"},{"$f":"мощность!B5","v":0},{"$f":"мощность!C5","v":0},{"$f":"мощность!D5","v":0},{"$f":"мощность!E5","v":0},{"$f":"мощность!F5","v":0},{"$f":"мощность!G5","v":0},{"$f":"мощность!H5","v":0},{"$f":"мощность!I5","v":0},{"$f":"мощность!J5","v":0},{"$f":"мощность!K5","v":0},{"$f":"мощность!L5","v":0},{"$f":"мощность!M5","v":0},{"$f":"мощность!N5","v":0},{"$f":"мощность!O5","v":0},{"$f":"мощность!P5","v":0},{"$f":"мощность!Q5","v":0},{"$f":"мощность!R5","v":0},{"$f":"мощность!S5","v":0},{"$f":"мощность!T5","v":0},{"$f":"мощность!U5","v":0},{"$f":"мощность!V5","v":0},{"$f":"мощность!W5","v":0},{"$f":"мощность!X5","v":0},{"$f":"мощность!Y5","v":0},{"$f":"SUM(B6:Y6)","v":0}]
[{"$f":"мощность!AA6","v":"03.07.2025"},{"$f":"мощность!B6","v":0},{"$f":"мощность!C6","v":0},{"$f":"мощность!D6","v":0},{"$f":"мощность!E6","v":0},{"$f":"мощность!F6","v":0},{"$f":"мощность!G6","v":0},{"$f":"мощность!H6","v":0},{"$f":"мощность!I6","v":0},{"$f":"мощность!J6","v":0},{"$f":"мощность!K6","v":0},{"$f":"мощность!L6","v":0},{"$f":"мощность!M6","v":0},{"$f":"мощность!N6","v":0},{"$f":"мощность!O6","v":0},{"$f":"мощность!P6","v":0},{"$f":"мощность!Q6","v":0},{"$f":"мощность!R6","v":0},{"$f":"мощность!S6","v":0},{"$f":"мощность!T6","v":0},{"$f":"мощность!U6","v":0},{"$f":"мощность!V6","v":0},{"$f":"мощность!W6","v":0},{"$f":"мощность!X6","v":0},{"$f":"мощность!Y6","v":0},0]
[{"$f":"мощность!AA7","v":"04.07.2025"},{"$f":"мощность!B7","v":0},{"$f":"мощность!C7","v":0},{"$f":"мощность!D7","v":0},{"$f":"мощность!E7","v":0},{"$f":"мощность!F7","v":0},{"$f":"мощность!G7","v":0},{"$f":"мощность!H7","v":0},{"$f":"мощность!I7","v":0},{"$f":"мощность!J7","v":0},{"$f":"мощность!K7","v":0},{"$f":"мощность!L7","v":0},{"$f":"мощность!M7","v":0},{"$f":"мощность!N7","v":0},{"$f":"мощность!O7","v":0},{"$f":"мощность!P7","v":0},{"$f":"мощность!Q7","v":0},{"$f":"мощность!R7","v":0},{"$f":"мощность!S7","v":0},{"$f":"мощность!T7","v":0},{"$f":"мощность!U7","v":0},{"$f":"мощность!V7","v":0},{"$f":"мощность!W7","v":0},{"$f":"мощность!X7","v":0},{"$f":"мощность!Y7","v":0},0]
[{"$f":"мощность!AA8","v":"05.07.2025"},{"$f":"мощность!B8","v":0},{"$f":"мощность!C8","v":0},{"$f":"мощность!D8","v":0},{"$f":"мощность!E8","v":0},{"$f":"мощность!F8","v":0},{"$f":"мощность!G8","v":0},{"$f":"мощность!H8","v":0},{"$f":"мощность!I8","v":0},{"$f":"мощность!J8","v":0},{"$f":"мощность!K8","v":0},{"$f":"мощность!L8","v":0},{"$f":"мощность!M8","v":0},{"$f":"мощность!N8","v":0},{"$f":"мощность!O8","v":0},{"$f":"мощность!P8","v":0},{"$f":"мощность!Q8","v":0},{"$f":"мощность!R8","v":0},{"$f":"мощность!S8","v":0},{"$f":"мощность!T8","v":0},{"$f":"мощность!U8","v":0},{"$f":"мощность!V8","v":0},{"$f":"мощность!W8","v":0},{"$f":"мощность!X8","v":0},{"$f":"мощность!Y8","v":0},0]
[{"$f":"мощность!AA9","v":"06.07.2025"},{"$f":"мощность!B9","v":0},{"$f":"мощность!C9","v":0},{"$f":"мощность!D9","v":0},{"$f":"мощность!E9","v":0},{"$f":"мощность!F9","v":0},{"$f":"мощность!G9","v":0},{"$f":"мощность!H9","v":0},{"$f":"мощность!I9","v":0},{"$f":"мощность!J9","v":0},{"$f":"мощность!K9","v":0},{"$f":"мощность!L9","v":0},{"$f":"мощность!M9","v":0},{"$f":"мощность!N9","v":0},{"$f":"мощность!O9","v":0},{"$f":"мощность!P9","v":0},{"$f":"мощность!Q9","v":0},{"$f":"мощность!R9","v":0},{"$f":"мощность!S9","v":0},{"$f":"мощность!T9","v":0},{"$f":"мощность!U9","v":0},{"$f":"мощность!V9","v":0},{"$f":"мощность!W9","v":0},{"$f":"мощность!X9","v":0},{"$f":"мощность!Y9","v":0},0]
{"$rows_left_out":33}
{"sheet":"мощность","index":2,"n_rows":48,"n_cols":32,"rows_kept":48,"cut":false,"hidden":true,"merged":[[1,0,2,0],[1,1,1,24],[1,25,2,25],[37,16,37,21],[38,16,38,21]]}
["Месяц",{"$f":"IF(E1=1,\"январь\",IF(E1=2,\"февраль\",IF(E1=3,\"март\",IF(E1=4,\"апрель\",IF(E1=5,\"май\",IF(E1=6,\"июнь\",IF(E1=7,\"июль\",IF(E1=8,\"август\",IF(E1=9,\"сентябрь\",IF(E1=10,\"октябрь\",IF(E1=11,\"ноябрь\",IF(E1=12,\"декабрь\",0))))))))))))","v":"июль"},null,null,{"$f":"MONTH(H1)","v":7},null,null,"2025-07-01","заполнять зеленые ячейки",null,null,null,null,null,null,null,null,null,null,null,null,null,null,null,null,null,{"$f":"TODAY()","v":"2025-09-02"}]
["Дата\\Часы","Фактический почасовой объем производства  электрической энергии (мощности), кВтч",null,null,null,null,null,null,null,null,null,null,null,null,null,null,null,null,null,null,null,null,null,null,null,"Итого",null,null,"max","в"]
[null,1,2,3,4,5,6,7,8,9,10,11,12,13,14,15,16,17,18,19,20,21,22,23,24,null,null,null,"час","дата"]
[1,{"$f":"округл!$B$66","v":0},{"$f":"округл!$B$67","v":0},{"$f":"округл!$B$68","v":0},{"$f":"округл!$B$69","v":0},{"$f":"округл!$B$70","v":0},{"$f":"округл!$B$71","v":0},{"$f":"округл!$B$72","v":0},{"$f":"округл!$B$73","v":0},{"$f":"округл!$B$74","v":0},{"$f":"округл!$B$75","v":0},{"$f":"округл!$B$76","v":0},{"$f":"округл!$B$77","v":0},{"$f":"округл!$B$78","v":0},{"$f":"округл!$B$79","v":0},{"$f":"округл!$B$80","v":0},{"$f":"округл!$B$81","v":0},{"$f":"округл!$B$82","v":0},{"$f":"округл!$B$83","v":0},{"$f":"округл!$B$84","v":0},{"$f":"округл!$B$85","v":0},{"$f":"округл!$B$86","v":0},{"$f":"округл!$B$87","v":0},{"$f":"округл!$B$88","v":0},{"$f":"округл!$B$89","v":0},{"$f":"SUM(B4:Y4)","v":0},{"$f":"B43","v":"01.07.2025"},{"$f":"IF(AD4=\"выходной\",\"\",INDEX($B$4:$Y$34,A4,LOOKUP(AC4,$B$3:$Y$3)))","v":0},{"$f":"VLOOKUP(AA4,'[1]Лист 1'!$A$7:$B$60,2,0)","v":11},{"$f":"IF($B$45=\"\",$B$44,$B$45)","v":"рабочий"}]
[2,{"$f":"округл!$C$66","v":0},{"$f":"округл!$C$67","v":0},{"$f":"округл!$C$68","v":0},{"$f":"округл!$C$69","v":0},{"$f":"округл!$C$70","v":0},{"$f":"округл!$C$71","v":0},{"$f":"округл!$C$72","v":0},{"$f":"округл!$C$73","v":0},{"$f":"округл!$C$74","v":0},{"$f":"округл!$C$75","v":0},{"$f":"округл!$C$76","v":0},{"$f":"округл!$C$77","v":0},{"$f":"округл!$C$78","v":0},{"$f":"округл!$C$79","v":0},{"$f":"округл!$C$80","v":0},{"$f":"округл!$C$81","v":0},{"$f":"округл!$C$82","v":0},{"$f":"округл!$C$83","v":0},{"$f":"округл!$C$84","v":0},{"$f":"округл!$C$85","v":0},{"$f":"округл!$C$86","v":0},{"$f":"округл!$C$87","v":0},{"$f":"округл!$C$88","v":0},{"$f":"округл!$C$89","v":0},{"$f":"SUM(B5:Y5)","v":0},{"$f":"$C$43","v":"02.07.2025"},{"$f":"IF(AD5=\"выходной\",\"\",INDEX($B$4:$Y$34,A5,LOOKUP(AC5,$B$3:$Y$3)))","v":0},{"$f":"VLOOKUP(AA5,'[1]Лист 1'!$A$7:$B$60,2,0)","v":10},{"$f":"IF($C$45=\"\",$C$44,$C$45)","v":"рабочий"}]
[3,{"$f":"округл!$D$66","v":0},{"$f":"округл!$D$67","v":0},{"$f":"округл!$D$68","v":0},{"$f":"округл!$D$69","v":0},{"$f":"округл!$D$70","v":0},{"$f":"округл!$D$71","v":0},{"$f":"округл!$D$72","v":0},{"$f":"округл!$D$73","v":0},{"$f":"округл!$D$74","v":0},{"$f":"округл!$D$75","v":0},{"$f":"округл!$D$76","v":0},{"$f":"округл!$D$77","v":0},{"$f":"округл!$D$78","v":0},{"$f":"округл!$D$79","v":0},{"$f":"округл!$D$80","v":0},{"$f":"округл!$D$81","v":0},{"$f":"округл!$D$82","v":0},{"$f":"округл!$D$83","v":0},{"$f":"округл!$D$84","v":0},{"$f":"округл!$D$85","v":0},{"$f":"округл!$D$86","v":0},{"$f":"округл!$D$87","v":0},{"$f":"округл!$D$88","v":0},{"$f":"округл!$D$89","v":0},0,{"$f":"$D$43","v":"03.07.2025"},{"$f":"IF(AD6=\"выходной\",\"\",INDEX($B$4:$Y$34,A6,LOOKUP(AC6,$B$3:$Y$3)))","v":0},{"$f":"VLOOKUP(AA6,'[1]Лист 1'!$A$7:$B$60,2,0)","v":12},{"$f":"IF($D$45=\"\",$D$44,$D$45)","v":"рабочий"}]
[4,{"$f":"округл!$E$66","v":0},{"$f":"округл!$E$67","v":0},{"$f":"округл!$E$68","v":0},{"$f":"округл!$E$69","v":0},{"$f":"округл!$E$70","v":0},{"$f":"округл!$E$71","v":0},{"$f":"округл!$E$72","v":0},{"$f":"округл!$E$73","v":0},{"$f":"округл!$E$74","v":0},{"$f":"округл!$E$75","v":0},{"$f":"округл!$E$76","v":0},{"$f":"округл!$E$77","v":0},{"$f":"округл!$E$78","v":0},{"$f":"округл!$E$79","v":0},{"$f":"округл!$E$80","v":0},{"$f":"округл!$E$81","v":0},{"$f":"округл!$E$82","v":0},{"$f":"округл!$E$83","v":0},{"$f":"округл!$E$84","v":0},{"$f":"округл!$E$85","v":0},{"$f":"округл!$E$86","v":0},{"$f":"округл!$E$87","v":0},{"$f":"округл!$E$88","v":0},{"$f":"округл!$E$89","v":0},0,{"$f":"$E$43","v":"04.07.2025"},0,{"$f":"VLOOKUP(AA7,'[1]Лист 1'!$A$7:$B$60,2,0)","v":11},{"$f":"IF($E$45=\"\",$E$44,$E$45)","v":"рабочий"}]
[5,{"$f":"округл!$F$66","v":0},{"$f":"округл!$F$67","v":0},{"$f":"округл!$F$68","v":0},{"$f":"округл!$F$69","v":0},{"$f":"округл!$F$70","v":0},{"$f":"округл!$F$71","v":0},{"$f":"округл!$F$72","v":0},{"$f":"округл!$F$73","v":0},{"$f":"округл!$F$74","v":0},{"$f":"округл!$F$75","v":0},{"$f":"округл!$F$76","v":0},{"$f":"округл!$F$77","v":0},{"$f":"округл!$F$78","v":0},{"$f":"округл!$F$79","v":0},{"$f":"округл!$F$80","v":0},{"$f":"округл!$F$81","v":0},{"$f":"округл!$F$82","v":0},{"$f":"округл!$F$83","v":0},{"$f":"округл!$F$84","v":0},{"$f":"округл!$F$85","v":0},{"$f":"округл!$F$86","v":0},{"$f":"округл!$F$87","v":0},{"$f":"округл!$F$88","v":0},{"$f":"округл!$F$89","v":0},0,{"$f":"$F$43","v":"05.07.2025"},"",{"$f":"VLOOKUP(AA8,'[1]Лист 1'!$A$7:$B$60,2,0)","v":{"$error":"#N/A"}},{"$f":"IF($F$45=\"\",$F$44,$F$45)","v":"выходной"}]
[6,{"$f":"округл!$G$66","v":0},{"$f":"округл!$G$67","v":0},{"$f":"округл!$G$68","v":0},{"$f":"округл!$G$69","v":0},{"$f":"округл!$G$70","v":0},{"$f":"округл!$G$71","v":0},{"$f":"округл!$G$72","v":0},{"$f":"округл!$G$73","v":0},{"$f":"округл!$G$74","v":0},{"$f":"округл!$G$75","v":0},{"$f":"округл!$G$76","v":0},{"$f":"округл!$G$77","v":0},{"$f":"округл!$G$78","v":0},{"$f":"округл!$G$79","v":0},{"$f":"округл!$G$80","v":0},{"$f":"округл!$G$81","v":0},{"$f":"округл!$G$82","v":0},{"$f":"округл!$G$83","v":0},{"$f":"округл!$G$84","v":0},{"$f":"округл!$G$85","v":0},{"$f":"округл!$G$86","v":0},{"$f":"округл!$G$87","v":0},{"$f":"округл!$G$88","v":0},{"$f":"округл!$G$89","v":0},0,{"$f":"$G$43","v":"06.07.2025"},{"$f":"IF(AD9=\"выходной\",\"\",INDEX($B$4:$Y$34,A9,LOOKUP(AC9,$B$3:$Y$3)))","v":""},{"$f":"VLOOKUP(AA9,'[1]Лист 1'!$A$7:$B$60,2,0)","v":{"$error":"#N/A"}},{"$f":"IF($G$45=\"\",$G$44,$G$45)","v":"выходной"}]
[7,{"$f":"округл!$H$66","v":0},{"$f":"округл!$H$67","v":0},{"$f":"округл!$H$68","v":0},{"$f":"округл!$H$69","v":0},{"$f":"округл!$H$70","v":0},{"$f":"округл!$H$71","v":0},{"$f":"округл!$H$72","v":0},{"$f":"округл!$H$73","v":0},{"$f":"округл!$H$74","v":0},{"$f":"округл!$H$75","v":0},{"$f":"округл!$H$76","v":0},{"$f":"округл!$H$77","v":0},{"$f":"округл!$H$78","v":0},{"$f":"округл!$H$79","v":0},{"$f":"округл!$H$80","v":0},{"$f":"округл!$H$81","v":0},{"$f":"округл!$H$82","v":0},{"$f":"округл!$H$83","v":0},{"$f":"округл!$H$84","v":0},{"$f":"округл!$H$85","v":0},{"$f":"округл!$H$86","v":0},{"$f":"округл!$H$87","v":0},{"$f":"округл!$H$88","v":0},{"$f":"округл!$H$89","v":0},0,{"$f":"$H$43","v":"07.07.2025"},0,{"$f":"VLOOKUP(AA10,'[1]Лист 1'!$A$7:$B$60,2,0)","v":11},{"$f":"IF($H$45=\"\",$H$44,$H$45)","v":"рабочий"}]
{"$rows_left_out":39}
{"sheet":"цены","index":3,"n_rows":754,"n_cols":14,"rows_kept":754,"cut":false,"hidden":true,"merged":[[746,6,747,6],[745,0,745,1],[746,0,747,1],[746,2,747,2],[746,3,747,3],[746,4,747,4],[746,5,747,5],[748,6,750,6],[752,0,753,1],[752,2,753,2],[752,3,753,3],[752,4,753,4],[752,5,753,5],[752,6,753,6],[748,0,750,1],[748,2,750,2],[748,3,750,3],[748,4,750,4],[748,5,750,5]]}
["Дата","Час","Объём (КВтч)","Цена руб/МВтч","1*Цена руб/МВтч","Стоимость (руб.)","Стоимость*0,9 (руб.)"]
[{"$f":"мощность!$AA$4","v":"01.07.2025"},0,{"$f":"мощность!B4","v":0},{"$f":"[2]Лист1!C58","v":1538},{"$f":"1*D2","v":1538},{"$f":"ROUND(C2*D2/1000,2)","v":0},{"$f":"ROUND(C2*E2/1000,2)","v":0}]
[{"$f":"мощность!$AA$4","v":"01.07.2025"},1,{"$f":"мощность!C4","v":0},{"$f":"[2]Лист1!C59","v":1277.58},{"$f":"1*D3","v":1277.58},{"$f":"ROUND(C3*D3/1000,2)","v":0},{"$f":"ROUND(C3*E3/1000,2)","v":0}]
[{"$f":"мощность!$AA$4","v":"01.07.2025"},2,{"$f":"мощность!D4","v":0},{"$f":"[2]Лист1!C60","v":1168.01},1168.01,0,0]
[{"$f":"мощность!$AA$4","v":"01.07.2025"},3,{"$f":"мощность!E4","v":0},{"$f":"[2]Лист1!C61","v":1057.01},1057.01,0,0]
[{"$f":"мощность!$AA$4","v":"01.07.2025"},4,{"$f":"мощность!F4","v":0},{"$f":"[2]Лист1!C62","v":1074.22},1074.22,0,0]
[{"$f":"мощность!$AA$4","v":"01.07.2025"},5,{"$f":"мощность!G4","v":0},{"$f":"[2]Лист1!C63","v":1340.27},1340.27,{"$f":"ROUND(C7*D7/1000,2)","v":0},0]
[{"$f":"мощность!$AA$4","v":"01.07.2025"},6,{"$f":"мощность!H4","v":0},{"$f":"[2]Лист1!C64","v":1473.06},1473.06,0,{"$f":"ROUND(C8*E8/1000,2)","v":0}]
[{"$f":"мощность!$AA$4","v":"01.07.2025"},7,{"$f":"мощность!I4","v":0},{"$f":"[2]Лист1!C65","v":1919.9},1919.9,0,0]
[{"$f":"мощность!$AA$4","v":"01.07.2025"},8,{"$f":"мощность!J4","v":0},{"$f":"[2]Лист1!C66","v":2396.61},2396.61,0,{"$f":"ROUND(C10*E10/1000,2)","v":0}]
{"$rows_left_out":745}
{"sheet":"округл","index":4,"n_rows":116,"n_cols":65,"rows_kept":116,"cut":false,"hidden":true,"merged":[]}
[null,"Почасовые расходы,кВтч ( мощность,кВт ) "]
[]
[null,"за ",{"$f":"мощность!B1","v":"июль"}]
[]
[null,1,2,3,4,5,6,7,8,9,10,11,12,13,14,15,16,17,18,19,20,21,22,23,24,25,26,27,28,29,30,31]
[1,{"$f":"ввод!$B$5","v":0},{"$f":"ввод!$B$6","v":0},{"$f":"ввод!$B$7","v":0},{"$f":"ввод!$B$8","v":0},{"$f":"ввод!$B$9","v":0},{"$f":"ввод!$B$10","v":0},{"$f":"ввод!$B$11","v":0},{"$f":"ввод!$B$12","v":0},{"$f":"ввод!$B$13","v":0},{"$f":"ввод!$B$14","v":0},{"$f":"ввод!$B$15","v":0},{"$f":"ввод!$B$16","v":0},{"$f":"ввод!$B$17","v":0},{"$f":"ввод!$B$18","v":0},{"$f":"ввод!$B$19","v":0},{"$f":"ввод!$B$20","v":0},{"$f":"ввод!$B$21","v":0},{"$f":"ввод!$B$22","v":0},{"$f":"ввод!$B$23","v":0},{"$f":"ввод!$B$24","v":0},{"$f":"ввод!$B$25","v":0},{"$f":"ввод!$B$26","v":0},{"$f":"ввод!$B$27","v":0},{"$f":"ввод!$B$28","v":0},{"$f":"ввод!$B$29","v":0},{"$f":"ввод!$B$30","v":0},{"$f":"ввод!$B$31","v":0},{"$f":"ввод!$B$32","v":0},{"$f":"ввод!$B$33","v":0},{"$f":"ввод!$B$34","v":0},{"$f":"ввод!$B$35","v":0}]
[2,{"$f":"ввод!$C$5","v":0},{"$f":"ввод!$C$6","v":0},{"$f":"ввод!$C$7","v":0},{"$f":"ввод!$C$8","v":0},{"$f":"ввод!$C$9","v":0},{"$f":"ввод!$C$10","v":0},{"$f":"ввод!$C$11","v":0},{"$f":"ввод!$C$12","v":0},{"$f":"ввод!$C$13","v":0},{"$f":"ввод!$C$14","v":0},{"$f":"ввод!$C$15","v":0},{"$f":"ввод!$C$16","v":0},{"$f":"ввод!$C$17","v":0},{"$f":"ввод!$C$18","v":0},{"$f":"ввод!$C$19","v":0},{"$f":"ввод!$C$20","v":0},{"$f":"ввод!$C$21","v":0},{"$f":"ввод!$C$22","v":0},{"$f":"ввод!$C$23","v":0},{"$f":"ввод!$C$24","v":0},{"$f":"ввод!$C$25","v":0},{"$f":"ввод!$C$26","v":0},{"$f":"ввод!$C$27","v":0},{"$f":"ввод!$C$28","v":0},{"$f":"ввод!$C$29","v":0},{"$f":"ввод!$C$30","v":0},{"$f":"ввод!$C$31","v":0},{"$f":"ввод!$C$32","v":0},{"$f":"ввод!$C$33","v":0},{"$f":"ввод!$C$34","v":0},{"$f":"ввод!$C$35","v":0}]
[3,{"$f":"ввод!$D$5","v":0},{"$f":"ввод!$D$6","v":0},{"$f":"ввод!$D$7","v":0},{"$f":"ввод!$D$8","v":0},{"$f":"ввод!$D$9","v":0},{"$f":"ввод!$D$10","v":0},{"$f":"ввод!$D$11","v":0},{"$f":"ввод!$D$12","v":0},{"$f":"ввод!$D$13","v":0},{"$f":"ввод!$D$14","v":0},{"$f":"ввод!$D$15","v":0},{"$f":"ввод!$D$16","v":0},{"$f":"ввод!$D$17","v":0},{"$f":"ввод!$D$18","v":0},{"$f":"ввод!$D$19","v":0},{"$f":"ввод!$D$20","v":0},{"$f":"ввод!$D$21","v":0},{"$f":"ввод!$D$22","v":0},{"$f":"ввод!$D$23","v":0},{"$f":"ввод!$D$24","v":0},{"$f":"ввод!$D$25","v":0},{"$f":"ввод!$D$26","v":0},{"$f":"ввод!$D$27","v":0},{"$f":"ввод!$D$28","v":0},{"$f":"ввод!$D$29","v":0},{"$f":"ввод!$D$30","v":0},{"$f":"ввод!$D$31","v":0},{"$f":"ввод!$D$32","v":0},{"$f":"ввод!$D$33","v":0},{"$f":"ввод!$D$34","v":0},{"$f":"ввод!$D$35","v":0}]
[4,{"$f":"ввод!$E$5","v":0},{"$f":"ввод!$E$6","v":0},{"$f":"ввод!$E$7","v":0},{"$f":"ввод!$E$8","v":0},{"$f":"ввод!$E$9","v":0},{"$f":"ввод!$E$10","v":0},{"$f":"ввод!$E$11","v":0},{"$f":"ввод!$E$12","v":0},{"$f":"ввод!$E$13","v":0},{"$f":"ввод!$E$14","v":0},{"$f":"ввод!$E$15","v":0},{"$f":"ввод!$E$16","v":0},{"$f":"ввод!$E$17","v":0},{"$f":"ввод!$E$18","v":0},{"$f":"ввод!$E$19","v":0},{"$f":"ввод!$E$20","v":0},{"$f":"ввод!$E$21","v":0},{"$f":"ввод!$E$22","v":0},{"$f":"ввод!$E$23","v":0},{"$f":"ввод!$E$24","v":0},{"$f":"ввод!$E$25","v":0},{"$f":"ввод!$E$26","v":0},{"$f":"ввод!$E$27","v":0},{"$f":"ввод!$E$28","v":0},{"$f":"ввод!$E$29","v":0},{"$f":"ввод!$E$30","v":0},{"$f":"ввод!$E$31","v":0},{"$f":"ввод!$E$32","v":0},{"$f":"ввод!$E$33","v":0},{"$f":"ввод!$E$34","v":0},{"$f":"ввод!$E$35","v":0}]
[5,{"$f":"ввод!$F$5","v":0},{"$f":"ввод!$F$6","v":0},{"$f":"ввод!$F$7","v":0},{"$f":"ввод!$F$8","v":0},{"$f":"ввод!$F$9","v":0},{"$f":"ввод!$F$10","v":0},{"$f":"ввод!$F$11","v":0},{"$f":"ввод!$F$12","v":0},{"$f":"ввод!$F$13","v":0},{"$f":"ввод!$F$14","v":0},{"$f":"ввод!$F$15","v":0},{"$f":"ввод!$F$16","v":0},{"$f":"ввод!$F$17","v":0},{"$f":"ввод!$F$18","v":0},{"$f":"ввод!$F$19","v":0},{"$f":"ввод!$F$20","v":0},{"$f":"ввод!$F$21","v":0},{"$f":"ввод!$F$22","v":0},{"$f":"ввод!$F$23","v":0},{"$f":"ввод!$F$24","v":0},{"$f":"ввод!$F$25","v":0},{"$f":"ввод!$F$26","v":0},{"$f":"ввод!$F$27","v":0},{"$f":"ввод!$F$28","v":0},{"$f":"ввод!$F$29","v":0},{"$f":"ввод!$F$30","v":0},{"$f":"ввод!$F$31","v":0},{"$f":"ввод!$F$32","v":0},{"$f":"ввод!$F$33","v":0},{"$f":"ввод!$F$34","v":0},{"$f":"ввод!$F$35","v":0}]
{"$rows_left_out":106}